CRAN Package Check Results for Maintainer ‘Mohamed El Fodil Ihaddaden <ihaddaden.fodeil at gmail.com>’

Last updated on 2020-12-04 01:51:31 CET.

Package ERROR NOTE OK
algo 12
BARIS 5 7
batata 12
bubblyr 12
corazon 12
fabricerin 12
farrell 5 7
flipdownr 12
GomoGomonoMi 12
mailtoR 12
radous 2 10
ralger 1 4 7
rintimg 12
Rnightly 12
scrollrevealR 12

Package algo

Current CRAN status: OK: 12

Package BARIS

Current CRAN status: NOTE: 5, OK: 7

Version: 1.1.1
Check: dependencies in R code
Result: NOTE
    Namespace in Imports field not imported from: ‘rstudioapi’
     All declared Imports should be used.
Flavors: r-devel-linux-x86_64-fedora-clang, r-devel-linux-x86_64-fedora-gcc, r-patched-solaris-x86, r-release-macos-x86_64, r-oldrel-macos-x86_64

Package batata

Current CRAN status: OK: 12

Package bubblyr

Current CRAN status: OK: 12

Package corazon

Current CRAN status: OK: 12

Package fabricerin

Current CRAN status: OK: 12

Package farrell

Current CRAN status: NOTE: 5, OK: 7

Version: 0.2.1
Check: dependencies in R code
Result: NOTE
    Namespace in Imports field not imported from: ‘rlang’
     All declared Imports should be used.
Flavors: r-devel-linux-x86_64-fedora-clang, r-devel-linux-x86_64-fedora-gcc, r-patched-solaris-x86, r-release-macos-x86_64, r-oldrel-macos-x86_64

Package flipdownr

Current CRAN status: OK: 12

Package GomoGomonoMi

Current CRAN status: OK: 12

Package mailtoR

Current CRAN status: OK: 12

Package radous

Current CRAN status: ERROR: 2, OK: 10

Version: 0.1.0
Check: tests
Result: ERROR
     Running ‘testthat.R’ [2s/4s]
    Running the tests in ‘tests/testthat.R’ failed.
    Complete output:
     > library(testthat)
     > library(radous)
     >
     > test_check("radous")
     ── Warning (test-test_get_data.R:6:1): (code run outside of `test_that()`) ─────
     3 parsing failures.
     row col expected actual file
     2 -- 1 columns 2 columns literal data
     5 -- 1 columns 2 columns literal data
     7 -- 1 columns 5 columns literal data
    
    
     ── Warning (test-test_get_data.R:13:3): testing identical results ──────────────
     3 parsing failures.
     row col expected actual file
     2 -- 1 columns 2 columns literal data
     5 -- 1 columns 2 columns literal data
     7 -- 1 columns 5 columns literal data
    
    
     ── FAILURE (test-test_get_data.R:13:3): testing identical results ──────────────
     `final` not identical to get_data(n = 10, seed = "123").
     Component "html": 2 string mismatches
    
     ── Warning (test-test_get_data.R:15:3): testing identical results ──────────────
     3 parsing failures.
     row col expected actual file
     2 -- 1 columns 2 columns literal data
     5 -- 1 columns 2 columns literal data
     7 -- 1 columns 5 columns literal data
    
    
     ── Warning (test-test_get_data.R:17:3): testing identical results ──────────────
     3 parsing failures.
     row col expected actual file
     2 -- 1 columns 2 columns literal data
     5 -- 1 columns 2 columns literal data
     7 -- 1 columns 5 columns literal data
    
    
     ══ testthat results ═══════════════════════════════════════════════════════════
     Warning (test-test_get_data.R:6:1): (code run outside of `test_that()`)
     Warning (test-test_get_data.R:13:3): testing identical results
     FAILURE (test-test_get_data.R:13:3): testing identical results
     Warning (test-test_get_data.R:15:3): testing identical results
     Warning (test-test_get_data.R:17:3): testing identical results
    
     [ FAIL 1 | WARN 4 | SKIP 0 | PASS 2 ]
     Error: Test failures
     Execution halted
Flavor: r-devel-linux-x86_64-debian-gcc

Version: 0.1.0
Check: tests
Result: ERROR
     Running ‘testthat.R’ [3s/4s]
    Running the tests in ‘tests/testthat.R’ failed.
    Complete output:
     > library(testthat)
     > library(radous)
     >
     > test_check("radous")
     ── Warning (test-test_get_data.R:6:1): (code run outside of `test_that()`) ─────
     3 parsing failures.
     row col expected actual file
     2 -- 1 columns 2 columns literal data
     5 -- 1 columns 2 columns literal data
     7 -- 1 columns 5 columns literal data
    
    
     ── Warning (test-test_get_data.R:13:3): testing identical results ──────────────
     3 parsing failures.
     row col expected actual file
     2 -- 1 columns 2 columns literal data
     5 -- 1 columns 2 columns literal data
     7 -- 1 columns 5 columns literal data
    
    
     ── FAILURE (test-test_get_data.R:13:3): testing identical results ──────────────
     `final` not identical to get_data(n = 10, seed = "123").
     Component "html": 2 string mismatches
    
     ── FAILURE (test-test_get_data.R:17:3): testing identical results ──────────────
     ncol(final) not equal to ncol(get_data(n = 10, seed = "123")).
     1/1 mismatches
     [1] 1 - 34 == -33
    
     ══ testthat results ═══════════════════════════════════════════════════════════
     Warning (test-test_get_data.R:6:1): (code run outside of `test_that()`)
     Warning (test-test_get_data.R:13:3): testing identical results
     FAILURE (test-test_get_data.R:13:3): testing identical results
     FAILURE (test-test_get_data.R:17:3): testing identical results
    
     [ FAIL 2 | WARN 2 | SKIP 0 | PASS 1 ]
     Error: Test failures
     Execution halted
Flavor: r-patched-linux-x86_64

Package ralger

Current CRAN status: ERROR: 1, NOTE: 4, OK: 7

Version: 2.2.0
Check: dependencies in R code
Result: NOTE
    Namespace in Imports field not imported from: ‘testthat’
     All declared Imports should be used.
Flavors: r-devel-linux-x86_64-fedora-clang, r-devel-linux-x86_64-fedora-gcc, r-patched-solaris-x86, r-release-macos-x86_64, r-oldrel-macos-x86_64

Version: 2.2.0
Check: tests
Result: ERROR
     Running ‘testthat.R’ [8s/27s]
    Running the tests in ‘tests/testthat.R’ failed.
    Last 13 lines of output:
     7. ├─base::suppressWarnings(...)
     8. │ └─base::withCallingHandlers(expr, warning = function(w) invokeRestart("muffleWarning"))
     9. ├─xml2::read_xml(x, encoding = encoding, ..., as_html = TRUE, options = options)
     10. └─xml2:::read_xml.character(...)
     11. └─xml2:::read_xml.connection(...)
     12. ├─base::open(x, "rb")
     13. └─base::open.connection(x, "rb")
    
     ══ testthat results ═══════════════════════════════════════════════════════════
     ERROR (test-paragraphs_scrap.R:2:3): paragraphs_scrap() works
     ERROR (test-titles_scrap.R:3:1): (code run outside of `test_that()`)
    
     [ FAIL 2 | WARN 0 | SKIP 0 | PASS 13 ]
     Error: Test failures
     Execution halted
Flavor: r-oldrel-macos-x86_64

Package rintimg

Current CRAN status: OK: 12

Package Rnightly

Current CRAN status: OK: 12

Package scrollrevealR

Current CRAN status: OK: 12